{"text_format":"1","workbook":"xlsx","n_sheets":9,"sheets":["SAM","P&L Statement","_SUMM_ROWS_LKP_YTD_","_SUMM_ROWS_LKP_","_HYPER_LKP_NEW_","__NOTES__","LOOKUPS","SANDBOX","_PROC_EXTRAS_LKP_"],"not_rendered":{"charts":0,"images":3,"macros":1,"external_links":0,"defined_names":5,"comments":0,"pivot_tables":0},"unopened":[],"bounds":{"document_bytes":16777216,"sheet_cells":100000,"rows_first":2000,"rows_last":500,"rows_between":2000,"halvings":0,"cell_chars":16384,"cell_head_chars":4096},"cells_cut":0,"cells_raw":0,"read":"whole","date_system":"1900"}

{"sheet":"SAM","index":0,"n_rows":652,"n_cols":14,"rows_kept":652,"cut":false,"hidden":false,"merged":[[587,2,587,3],[587,9,587,10],[587,11,587,12],[466,2,466,6],[467,2,467,6],[468,2,468,6],[469,2,469,6],[470,2,470,6],[471,2,471,5],[472,2,472,5],[476,2,476,6],[514,2,514,3],[518,2,518,6],[519,2,519,5],[520,2,520,6],[521,2,521,6],[552,2,552,6],[548,2,548,6],[549,2,549,6],[550,2,550,6],[497,2,497,6],[498,2,498,6],[499,2,499,5],[500,2,500,5],[628,2,628,3],[628,9,628,10],[628,11,628,12],[629,2,629,3],[629,9,629,10],[629,11,629,12],[625,2,625,3],[625,9,625,10],[625,11,625,12],[626,2,626,3],[626,9,626,10],[626,11,626,12],[627,2,627,3],[627,9,627,10],[627,11,627,12],[623,2,623,3],[623,9,623,10],[623,11,623,12],[624,2,624,3],[624,9,624,10],[624,11,624,12],[607,2,607,3],[607,9,607,10],[607,11,607,12],[618,2,618,3],[618,9,618,10],[618,11,618,12],[619,2,619,3],[619,9,619,10],[619,11,619,12],[622,2,622,3],[622,9,622,10],[622,11,622,12],[620,2,620,3],[620,9,620,10],[620,11,620,12],[621,2,621,3],[621,9,621,10],[621,11,621,12],[614,2,614,3],[614,9,614,10],[614,11,614,12],[615,2,615,3],[615,9,615,10],[615,11,615,12],[616,2,616,3],[616,9,616,10],[616,11,616,12],[604,2,604,3],[604,9,604,10],[604,11,604,12],[605,2,605,3],[605,9,605,10],[609,11,609,12],[605,11,605,12],[609,2,609,3],[613,2,613,3],[613,9,613,10],[613,11,613,12],[603,2,603,3],[603,9,603,10],[603,11,603,12],[598,2,598,3],[598,9,598,10],[598,11,598,12],[600,2,600,3],[600,9,600,10],[600,11,600,12],[602,2,602,3],[602,9,602,10],[602,11,602,12],[504,2,504,6],[505,2,505,5],[510,2,510,3],[510,4,510,6],[491,2,491,6],[492,2,492,5],[493,2,493,6],[494,2,494,6],[495,2,495,6],[496,2,496,6],[483,4,483,6],[483,2,483,3],[487,2,487,3],[456,2,456,6],[462,2,462,3],[421,2,421,3],[421,4,421,6],[425,2,425,6],[426,2,426,6],[432,2,432,3],[436,2,436,6],[437,2,437,6],[438,2,438,6],[439,2,439,6],[440,2,440,6],[441,2,441,5],[442,2,442,5],[446,2,446,6],[451,2,451,3],[451,4,451,6],[455,2,455,6],[402,2,402,3],[406,2,406,6],[407,2,407,6],[408,2,408,6],[409,2,409,6],[410,2,410,6],[411,2,411,5],[412,2,412,5],[416,2,416,6],[379,2,379,6],[380,2,380,6],[381,2,381,5],[382,2,382,5],[386,2,386,6],[391,2,391,3],[391,4,391,6],[395,2,395,6],[396,2,396,6],[356,2,356,6],[361,2,361,3],[361,4,361,6],[365,2,365,6],[366,2,366,6],[372,2,372,3],[376,2,376,6],[377,2,377,6],[378,2,378,6],[312,2,312,3],[342,2,342,3],[346,2,346,6],[347,2,347,6],[348,2,348,6],[349,2,349,6],[350,2,350,6],[351,2,351,5],[352,2,352,5],[321,2,321,5],[326,2,326,6],[331,2,331,3],[331,4,331,6],[335,2,335,6],[336,2,336,6],[316,2,316,6],[317,2,317,6],[318,2,318,6],[319,2,319,6],[320,2,320,6],[322,2,322,5],[289,2,289,5],[290,2,290,5],[294,2,294,6],[271,2,271,6],[272,2,272,6],[273,2,273,6],[283,2,283,6],[284,2,284,6],[285,2,285,6],[286,2,286,6],[287,2,287,6],[288,2,288,6],[279,2,279,3],[252,2,252,6],[253,2,253,6],[254,2,254,6],[255,2,255,6],[256,2,256,6],[257,2,257,5],[258,2,258,5],[262,2,262,6],[267,2,267,3],[267,4,267,6],[225,2,225,5],[226,2,226,5],[230,2,230,6],[235,2,235,3],[235,4,235,6],[239,2,239,6],[240,2,240,6],[241,2,241,6],[251,2,251,6],[247,2,247,3],[207,2,207,6],[208,2,208,6],[209,2,209,6],[219,2,219,6],[220,2,220,6],[221,2,221,6],[222,2,222,6],[223,2,223,6],[224,2,224,6],[215,2,215,3],[188,2,188,6],[189,2,189,6],[190,2,190,6],[191,2,191,6],[192,2,192,6],[193,2,193,5],[194,2,194,5],[198,2,198,6],[203,2,203,3],[203,4,203,6],[2,2,2,3],[2,4,2,7],[111,2,111,6],[112,2,112,6],[6,2,6,6],[8,2,8,6],[9,2,9,6],[14,2,14,6],[18,2,18,6],[16,3,16,6],[31,3,31,6],[24,2,24,5],[25,2,25,6],[26,2,26,6],[27,2,27,6],[19,2,19,6],[20,2,20,6],[21,2,21,6],[22,2,22,5],[23,2,23,6],[37,2,37,5],[38,2,38,6],[65,2,65,6],[39,2,39,5],[40,2,40,6],[41,2,41,6],[33,2,33,6],[34,2,34,6],[35,2,35,6],[36,2,36,6],[51,2,51,6],[52,2,52,5],[56,2,56,6],[57,2,57,6],[63,2,63,6],[64,2,64,6],[61,3,61,6],[53,2,53,6],[54,2,54,5],[55,2,55,6],[42,2,42,6],[48,2,48,6],[49,2,49,6],[50,2,50,6],[46,3,46,6],[86,2,86,6],[70,2,70,6],[71,2,71,6],[72,2,72,6],[77,2,77,6],[79,2,79,6],[97,2,97,6],[84,2,84,4],[66,2,66,6],[67,2,67,5],[68,2,68,6],[69,2,69,5],[183,2,183,3],[151,2,151,3],[98,2,98,6],[99,2,99,6],[100,2,100,6],[87,2,87,5],[88,2,88,6],[93,2,93,6],[95,2,95,6],[96,2,96,6],[113,2,113,6],[107,2,107,3],[107,4,107,6],[119,2,119,3],[123,2,123,6],[124,2,124,6],[125,2,125,6],[126,2,126,6],[127,2,127,6],[128,2,128,6],[129,2,129,5],[130,2,130,5],[134,2,134,6],[301,2,301,3],[301,4,301,6],[305,2,305,6],[306,2,306,6],[161,2,161,5],[162,2,162,5],[160,2,160,6],[139,2,139,3],[139,4,139,6],[143,2,143,6],[144,2,144,6],[145,2,145,6],[155,2,155,6],[156,2,156,6],[157,2,157,6],[158,2,158,6],[159,2,159,6],[166,2,166,6],[171,2,171,3],[171,4,171,6],[175,2,175,6],[176,2,176,6],[177,2,177,6],[187,2,187,6],[551,2,551,6],[523,2,523,6],[524,2,524,6],[525,2,525,6],[526,2,526,5],[527,2,527,5],[522,2,522,6],[531,2,531,6],[532,2,532,5],[537,2,537,3],[537,4,537,6],[541,2,541,3],[545,2,545,6],[546,2,546,5],[547,2,547,6],[575,2,575,3],[575,9,575,10],[575,11,575,12],[573,2,573,3],[573,9,573,10],[573,11,573,12],[569,2,569,11],[571,11,572,12],[571,4,571,5],[571,7,571,8],[571,9,572,10],[553,2,553,5],[554,2,554,5],[558,2,558,6],[559,2,559,5],[571,1,571,3],[581,1,581,5],[579,2,579,3],[579,9,579,10],[579,11,579,12],[580,2,580,3],[580,9,580,10],[580,11,580,12],[576,2,576,3],[576,9,576,10],[576,11,576,12],[577,2,577,3],[577,9,577,10],[577,11,577,12],[578,2,578,3],[578,9,578,10],[578,11,578,12],[574,2,574,3],[574,9,574,10],[574,11,574,12],[582,2,582,3],[582,9,582,10],[582,11,582,12],[584,2,584,3],[584,9,584,10],[584,11,584,12],[586,2,586,3],[586,9,586,10],[586,11,586,12],[585,9,585,10],[585,11,585,12],[585,2,585,3],[583,2,583,3],[583,9,583,10],[583,11,583,12],[588,2,588,3],[588,9,588,10],[588,11,588,12],[590,2,590,3],[590,9,590,10],[590,11,590,12],[592,2,592,3],[592,9,592,10],[592,11,592,12],[589,2,589,3],[589,9,589,10],[589,11,589,12],[591,2,591,3],[591,9,591,10],[591,11,591,12],[595,2,595,3],[595,9,595,10],[595,11,595,12],[599,2,599,3],[599,9,599,10],[599,11,599,12],[637,9,637,10],[637,11,637,12],[638,2,638,3],[638,9,638,10],[638,11,638,12],[631,2,631,3],[631,9,631,10],[631,11,631,12],[632,2,632,3],[635,2,635,3],[635,9,635,10],[635,11,635,12],[636,2,636,3],[636,9,636,10],[636,11,636,12],[637,2,637,3],[611,11,611,12],[612,2,612,3],[644,2,651,11],[632,9,632,10],[632,11,632,12],[633,2,633,3],[633,9,633,10],[633,11,633,12],[610,2,610,3],[610,9,610,10],[610,11,610,12],[611,2,611,3],[611,9,611,10],[640,2,640,3],[640,9,640,10],[634,2,634,3],[634,9,634,10],[634,11,634,12],[639,2,639,3],[639,9,639,10],[639,11,639,12],[612,9,612,10],[612,11,612,12],[617,2,617,3],[617,9,617,10],[617,11,617,12],[1,2,1,10],[609,9,609,10],[606,9,606,10],[606,11,606,12],[608,2,608,3],[608,9,608,10],[608,11,608,12],[606,2,606,3],[630,1,630,5],[593,2,593,3],[593,9,593,10],[593,11,593,12],[597,2,597,3],[597,9,597,10],[597,11,597,12],[601,2,601,3],[601,9,601,10],[601,11,601,12],[594,2,594,3],[594,9,594,10],[594,11,594,12],[596,2,596,3],[596,9,596,10],[596,11,596,12]]}
[null," SAM Cash Flow Analysis Worksheet with P&L"]
[null,null,"User Tips:\n    • Add borrower information in blue-shaded fields\n    • Select the tax year(s) being reviewed\n    • Click the \"O\" button to expand income source section\n    • Use Summary section to analyze income trends\n    • Click the tax form line (shown in green) to access the searchable SEB manual\n    • Select the Reset Workbook button on top to clear all information"]
[null,null,"BORROWER NAME:",null,null,null,null,null,null,"DATE:  "]
[]
[null,null,null,null,null,"Select the Year(s):"]
[]
[null,"X","SCHEDULE B - INTEREST AND DIVIDENDS FROM SELF-EMPLOYMENT",null,null,null,null,{"$f":"IF(ISNUMBER($H$5),$H$5,\"\")","v":""},null,null,{"$f":"IF(ISNUMBER($K$5),$K$5,\"\")","v":""}]
[]
[null,1,"Recurring Interest Income: LINE 1 or 1040 LINE 2b"]
[null,2,"Recurring Dividend Income: LINE 5 or 1040 LINE 3b"]
[]
[null,null,"SUBTOTAL",null,null,null,null,{"$f":"SUM(H9:H10)","v":0},null,null,{"$f":"SUM(K9:K10)","v":0}]
[]
[]
[null,"X","SCHEDULE C - SOLE PROPRIETORSHIP",null,null,null,null,{"$f":"IF(ISNUMBER($H$5),$H$5,\"\")","v":""},null,null,{"$f":"IF(ISNUMBER($K$5),$K$5,\"\")","v":""}]
[]
[null,null,"Name:",null,null,null,null,{"$f":"IF(ISNUMBER($H$5),$H$5,\"\")","v":""},null,null,{"$f":"IF(ISNUMBER($K$5),$K$5,\"\")","v":""}]
[]
[null,3,"Net Profit (Loss): LINE 31"]
[null,4,"Deduct nonrecurring income/add nonrecurring loss or expense: LINE 6"]
{"$rows_left_out":633}
{"sheet":"P&L Statement","index":1,"n_rows":482,"n_cols":26,"rows_kept":482,"cut":false,"hidden":false,"merged":[[110,6,110,11],[6,6,6,11],[25,6,25,11],[44,6,44,11],[63,6,63,11],[84,6,84,11],[1,2,1,10],[474,2,481,23],[136,6,136,11],[162,6,162,11],[188,6,188,11],[214,6,214,11],[317,6,317,11],[342,6,342,11],[367,6,367,11],[394,6,394,11],[420,6,420,11],[446,6,446,11],[2,7,2,21],[242,6,242,11],[267,6,267,11],[292,6,292,11]]}
[null,"Profit and Loss Statement Analysis"]
[null,null,"User Tips:\n    • Add borrower information in blue-shaded fields\n    • Click the \"O\" button to expand income source section\n    • Click \"+\" to add additional columns within business section\n    • Select the Reset Workbook button on top to clear all information"]
[null,null,null,"BORROWER NAME:"]
[]
[null,"Sole Proprietorship Cash Flow"]
[null,null,"Use of this information is discretionary.  FOLLOW INVESTOR GUIDELINES."]
[null,"X","SOLE PROPRIETORSHIP",null,null,null,{"$f":"IF(OR(SAM!D17=0,SAM!D17=\"\"),\"\",SAM!D17)","v":""}]
[]
[null,null,null,"Time Frame (i.e., YTD, quarterly):",null,null,"M",null,"M","M",null,"M","M",null,"M","M",null,"M","M",null,"M","M",null,"M"]
[]
[null,null,null,"Date From:","HIDE","HIDE"]
[null,null,null,"Date Paid Through:","HIDE","HIDE"]
[null,null,null,null,"HIDE","HIDE"]
[null,"Net Profit (Loss):",null,null,"HIDE","HIDE"]
[null,"Deduct nonrecurring income:",null,null,"HIDE","HIDE","(",null,")","(",null,")","(",null,")","(",null,")","(",null,")","(",null,")"]
[null,"Add nonrecurring loss:",null,null,{"$f":"IF(MONTH(W11)=MONTH(W12),((YEAR(W12)-YEAR(W11))*12)-12+(12-MONTH(W11))+MONTH(W12)-1+(EOMONTH(W11,0)-W11+1)/DAY(EOMONTH(W11,0))+(1-(EOMONTH(W12,0)-W12)/DAY(EOMONTH(W12,0))),((YEAR(W12)-YEAR(W11))*12)-12+(12-MONTH(W11))+MONTH(W12)-1+(EOMONTH(W11,0)-W11+1)/DAY(EOMONTH(W11,0))+(1-(EOMONTH(W12,0)-W12)/DAY(EOMONTH(W12,0))))","v":3.2258064516129004E-2},{"$f":"ROUND(IF(AND(W11<>\"\",W12<>\"\"),IF(E16<=1,1,E16),0),2)","v":0}]
[null,"Depletion:",null,null,{"$f":"IF(MONTH(T11)=MONTH(T12),((YEAR(T12)-YEAR(T11))*12)-12+(12-MONTH(T11))+MONTH(T12)-1+(EOMONTH(T11,0)-T11+1)/DAY(EOMONTH(T11,0))+(1-(EOMONTH(T12,0)-T12)/DAY(EOMONTH(T12,0))),((YEAR(T12)-YEAR(T11))*12)-12+(12-MONTH(T11))+MONTH(T12)-1+(EOMONTH(T11,0)-T11+1)/DAY(EOMONTH(T11,0))+(1-(EOMONTH(T12,0)-T12)/DAY(EOMONTH(T12,0))))","v":3.2258064516129004E-2},{"$f":"ROUND(IF(AND(T11<>\"\",T12<>\"\"),IF(E17<=1,1,E17),0),2)","v":0}]
[null,"Depreciation:",null,null,{"$f":"IF(MONTH(Q11)=MONTH(Q12),((YEAR(Q12)-YEAR(Q11))*12)-12+(12-MONTH(Q11))+MONTH(Q12)-1+(EOMONTH(Q11,0)-Q11+1)/DAY(EOMONTH(Q11,0))+(1-(EOMONTH(Q12,0)-Q12)/DAY(EOMONTH(Q12,0))),((YEAR(Q12)-YEAR(Q11))*12)-12+(12-MONTH(Q11))+MONTH(Q12)-1+(EOMONTH(Q11,0)-Q11+1)/DAY(EOMONTH(Q11,0))+(1-(EOMONTH(Q12,0)-Q12)/DAY(EOMONTH(Q12,0))))","v":3.2258064516129004E-2},{"$f":"ROUND(IF(AND(Q11<>\"\",Q12<>\"\"),IF(E18<=1,1,E18),0),2)","v":0}]
[null,"Amortization/Casualty Loss:",null,null,{"$f":"IF(MONTH(N11)=MONTH(N12),((YEAR(N12)-YEAR(N11))*12)-12+(12-MONTH(N11))+MONTH(N12)-1+(EOMONTH(N11,0)-N11+1)/DAY(EOMONTH(N11,0))+(1-(EOMONTH(N12,0)-N12)/DAY(EOMONTH(N12,0))),((YEAR(N12)-YEAR(N11))*12)-12+(12-MONTH(N11))+MONTH(N12)-1+(EOMONTH(N11,0)-N11+1)/DAY(EOMONTH(N11,0))+(1-(EOMONTH(N12,0)-N12)/DAY(EOMONTH(N12,0))))","v":3.2258064516129004E-2},{"$f":"ROUND(IF(AND(N11<>\"\",N12<>\"\"),IF(E19<=1,1,E19),0),2)","v":0}]
[null,"Other:",null,null,{"$f":"IF(MONTH(K11)=MONTH(K12),((YEAR(K12)-YEAR(K11))*12)-12+(12-MONTH(K11))+MONTH(K12)-1+(EOMONTH(K11,0)-K11+1)/DAY(EOMONTH(K11,0))+(1-(EOMONTH(K12,0)-K12)/DAY(EOMONTH(K12,0))),((YEAR(K12)-YEAR(K11))*12)-12+(12-MONTH(K11))+MONTH(K12)-1+(EOMONTH(K11,0)-K11+1)/DAY(EOMONTH(K11,0))+(1-(EOMONTH(K12,0)-K12)/DAY(EOMONTH(K12,0))))","v":3.2258064516129004E-2},{"$f":"ROUND(IF(AND(K11<>\"\",K12<>\"\"),IF(E20<=1,1,E20),0),2)","v":0},"M"]
{"$rows_left_out":463}
{"sheet":"_SUMM_ROWS_LKP_YTD_","index":2,"n_rows":21,"n_cols":13,"rows_kept":21,"cut":false,"hidden":true,"merged":[]}
["SUMM_ROW","DATA_ROW","L","TITLE","SECTION","iMyRefRow","iSummRefRow","strMyDataCols","iThisRow","strMyDataRows","strMyExtra","strDefFormRef","strDefFormula"]
[1,false,"p.1","PERSONAL CASH FLOW SUBTOTALS:","NA","NA","NA","NA","NA","NA","NA","NA","NA"]
[2,true,"IV","Sole Proprietorship",1,7,7,"H,K,N,Q,T,W","NONE","2,4,5,7,8,9,10,11,12,13","D13","G0","=IF(OR(SAM!D17=0,SAM!D17=\"\"),\"\",SAM!D17)"]
[3,true,"IV","Sole Proprietorship",1,26,26,"H,K,N,Q,T,W","NONE","2,4,5,7,8,9,10,11,12,13","D13","G0","=IF(OR(SAM!D32=0,SAM!D32=\"\"),\"\",SAM!D32)"]
[4,true,"IV","Sole Proprietorship",1,45,45,"H,K,N,Q,T,W","NONE","2,4,5,7,8,9,10,11,12,13","D13","G0","=IF(OR(SAM!D47=0,SAM!D47=\"\"),\"\",SAM!D47)"]
[5,true,"IV","Sole Proprietorship",1,64,64,"H,K,N,Q,T,W","NONE","2,4,5,7,8,9,10,11,12,13","D13","G0","=IF(OR(SAM!D62=0,SAM!D62=\"\"),\"\",SAM!D62)"]
[6,true,"IV","Partnership",1,85,85,"H,K,N,Q,T,W","NONE","2,4,5,7,8,9,10,11,12,13,16,19,20","D13","G0","=IF(OR(SAM!E108=0,SAM!E108=\"\"),\"\",SAM!E108)"]
[7,true,"IV","Partnership",1,111,111,"H,K,N,Q,T,W","NONE","2,4,5,7,8,9,10,11,12,13,16,19,20","D13","G0","=IF(OR(SAM!E140=0,SAM!E140=\"\"),\"\",SAM!E140)"]
[8,true,"IV","Partnership",1,137,137,"H,K,N,Q,T,W","NONE","2,4,5,7,8,9,10,11,12,13,16,19,20","D13","G0","=IF(OR(SAM!E172=0,SAM!E172=\"\"),\"\",SAM!E172)"]
[9,true,"IV","Partnership",1,163,163,"H,K,N,Q,T,W","NONE","2,4,5,7,8,9,10,11,12,13,16,19,20","D13","G0","=IF(OR(SAM!E204=0,SAM!E204=\"\"),\"\",SAM!E204)"]
[10,true,"IV","Partnership",1,189,189,"H,K,N,Q,T,W","NONE","2,4,5,7,8,9,10,11,12,13,16,19,20","D13","G0","=IF(OR(SAM!E236=0,SAM!E236=\"\"),\"\",SAM!E236)"]
[11,true,"IV","Partnership",1,215,215,"H,K,N,Q,T,W","NONE","2,4,5,7,8,9,10,11,12,13,16,19,20","D13","G0","=IF(OR(SAM!E268=0,SAM!E268=\"\"),\"\",SAM!E268)"]
[12,true,"IV","S Corporation",1,243,243,"H,K,N,Q,T,W","NONE","2,4,5,7,8,9,10,11,12,13,16,19","D13","G0","=IF(OR(SAM!E302=0,SAM!E302=\"\"),\"\",SAM!E302)"]
[13,true,"IV","S Corporation",1,268,268,"H,K,N,Q,T,W","NONE","2,4,5,7,8,9,10,11,12,13,16,19","D13","G0","=IF(OR(SAM!E332=0,SAM!E332=\"\"),\"\",SAM!E332)"]
[14,true,"IV","S Corporation",1,293,293,"H,K,N,Q,T,W","NONE","2,4,5,7,8,9,10,11,12,13,16,19","D13","G0","=IF(OR(SAM!E362=0,SAM!E362=\"\"),\"\",SAM!E362)"]
[15,true,"IV","S Corporation",1,318,318,"H,K,N,Q,T,W","NONE","2,4,5,7,8,9,10,11,12,13,16,19","D13","G0","=IF(OR(SAM!E392=0,SAM!E392=\"\"),\"\",SAM!E392)"]
[16,true,"IV","S Corporation",1,343,343,"H,K,N,Q,T,W","NONE","2,4,5,7,8,9,10,11,12,13,16,19","D13","G0","=IF(OR(SAM!E422=0,SAM!E422=\"\"),\"\",SAM!E422)"]
[17,true,"IV","S Corporation",1,368,368,"H,K,N,Q,T,W","NONE","2,4,5,7,8,9,10,11,12,13,16,19","D13","G0","=IF(OR(SAM!E452=0,SAM!E452=\"\"),\"\",SAM!E452)"]
[18,true,"IV","Corporation",1,395,395,"H,K,N,Q,T,W","NONE","2,4,5,7,8,9,10,11,12,13,14,17,20","D13","G0","=IF(OR(SAM!E484=0,SAM!E484=\"\"),\"\",SAM!E484)"]
[19,true,"IV","Corporation",1,421,421,"H,K,N,Q,T,W","NONE","2,4,5,7,8,9,10,11,12,13,14,17,20","D13","G0","=IF(OR(SAM!E511=0,SAM!E511=\"\"),\"\",SAM!E511)"]
{"$rows_left_out":2}
{"sheet":"_SUMM_ROWS_LKP_","index":3,"n_rows":70,"n_cols":15,"rows_kept":70,"cut":false,"hidden":true,"merged":[]}
["SUMM_ROW","DATA_ROW","L","TITLE","SECTION","iMyRefRow","iSummRefRow","strMyDataCols","iThisRow","strMyDataRows","strMyExtra","colsElements","dataElements","plus","total"]
[572,false,"p.1","PERSONAL CASH FLOW SUBTOTALS:","NA","NA","NA","NA","NA","NA","NA",0,0,0,0]
[{"$f":"A2+2","v":574},true,"IV","Schedule B",1,7,{"$f":"F3","v":7},"H,K","NONE","2,3","NONE",{"$f":"NumElements(H3,\",\")","v":2},{"$f":"NumElements(J3,\",\")","v":2},{"$f":"IF(NOT(OR(K3=\"NONE\",K3=\"NA\")),1,0)","v":0},{"$f":"(L3*M3)+N3","v":4}]
[{"$f":"A3+1","v":575},true,"V","Schedule C   ",1,15,{"$f":"F4+2","v":17},"H,K","NONE","2,3,4,5,6,7,8,11","D0",{"$f":"NumElements(H4,\",\")","v":2},{"$f":"NumElements(J4,\",\")","v":8},{"$f":"IF(NOT(OR(K4=\"NONE\",K4=\"NA\")),1,0)","v":1},{"$f":"(L4*M4)+N4","v":17}]
[576,true,"V","Schedule C   ",2,15,{"$f":"F5+17","v":32},"H,K","NONE","2,3,4,5,6,7,8,11","D0",2,8,1,17]
[577,true,"V","Schedule C   ",3,15,{"$f":"F6+32","v":47},"H,K","NONE","2,3,4,5,6,7,8,11","D0",2,8,1,17]
[578,true,"V","Schedule C   ",4,15,{"$f":"F7+47","v":62},"H,K","NONE","2,3,4,5,6,7,8,11","D0",2,8,1,17]
[579,true,"VI","Schedule D",1,78,{"$f":"F8","v":78},"H,K","NONE",2,"NONE",2,1,0,2]
[580,true,"VIII","Schedule E",1,85,{"$f":"F9","v":85},"H,K","NONE","2,3,4","NONE",2,3,0,6]
[581,true,"IX","Schedule F",1,94,{"$f":"F10","v":94},"H,K","NONE","2,3,4,5,6,7","NONE",2,6,0,12]
[582,false,"p.2","PARTNERSHIP & S CORPORATION CASH FLOW SUBTOTALS:","NA","NA","NA","NA","NA","NA","NA",1,1,0,1]
[583,true,"X","K-1 (Form 1065)   ",1,108,{"$f":"F12","v":108},"H,K","NONE","4,5,6","E0",2,3,1,7]
[584,true,"X","W-2 Wages",1,108,108,"H,K","NONE",12,"E0",2,1,1,3]
[585,true,"XI","Form 1065   ",1,108,{"$f":"F14","v":108},"H,K","NONE","16,17,18,19,20,21,22,23,27","E0",2,9,1,19]
[586,true,"NA","Partnership Subtotal",1,108,108,"H,K","NONE","4,5,6,12,16,17,18,19,20,21,22,23,27","NONE",2,13,0,26]
[587,true,"X","K-1 (Form 1065)   ",1,140,140,"H,K","NONE","4,5,6","E0",2,3,1,7]
[588,true,"X","W-2 Wages",1,140,140,"H,K","NONE",12,"E0",2,1,1,3]
[589,true,"XI","Form 1065   ",1,140,140,"H,K","NONE","16,17,18,19,20,21,22,23,27","E0",2,9,1,19]
[590,true,"NA","Partnership Subtotal",1,140,140,"H,K","NONE","4,5,6,12,16,17,18,19,20,21,22,23,27","NONE",2,13,0,26]
[591,true,"X","K-1 (Form 1065)   ",1,172,172,"H,K","NONE","4,5,6","E0",2,3,1,7]
{"$rows_left_out":51}
{"sheet":"_HYPER_LKP_NEW_","index":4,"n_rows":57,"n_cols":10,"rows_kept":57,"cut":false,"hidden":true,"merged":[]}
["NUM","SECTION","COL_REF","ROW_NUM","LINE_TEXT","PAGE_LINK","BASE_PATH","FILE_NAME","ADDTL","EXAMPLE_URL"]
[1,"Schedule B","B",1,"Recurring Interest Income","#page2","https://www.mgic.com/-/media/value-adds/seb/","22-25000-sam-worksheet-help-doc.pdf","view=fit","https://www.mgic.com/-/media/MGIC/seb/22-25000_sam_worksheet_help_doc-2021.pdf"]
[2,null,"B",2,"Recurring Dividend Income","#page2","https://www.mgic.com/-/media/value-adds/seb/","22-25000-sam-worksheet-help-doc.pdf","view=fit"]
[3,"Schedule C","B",3,"Net Profit","#page3","https://www.mgic.com/-/media/value-adds/seb/","22-25000-sam-worksheet-help-doc.pdf","view=fit",{"$f":"G4&H4&LEFT(F4,5)&\"=\"&RIGHT(F4,LEN(F4)-5)&\"&\"&I4","v":"https://www.mgic.com/-/media/value-adds/seb/22-25000-sam-worksheet-help-doc.pdf#page=3&view=fit"}]
[4,null,"B",4,"Deduct nonrecurring income","#page3","https://www.mgic.com/-/media/value-adds/seb/","22-25000-sam-worksheet-help-doc.pdf","view=fit"]
[5,null,"B",5,"Depletion","#page3","https://www.mgic.com/-/media/value-adds/seb/","22-25000-sam-worksheet-help-doc.pdf","view=fit"]
[6,null,"B",6,"Depreciation","#page3","https://www.mgic.com/-/media/value-adds/seb/","22-25000-sam-worksheet-help-doc.pdf","view=fit"]
[7,null,"B",7,"Meals or Meals and Entertainment","#page3","https://www.mgic.com/-/media/value-adds/seb/","22-25000-sam-worksheet-help-doc.pdf","view=fit"]
[8,null,"B",8,"Business Use of Home","#page3","https://www.mgic.com/-/media/value-adds/seb/","22-25000-sam-worksheet-help-doc.pdf","view=fit"]
[9,null,"B",9,"Business Miles","#page4","https://www.mgic.com/-/media/value-adds/seb/","22-25000-sam-worksheet-help-doc.pdf","view=fit"]
[10,null,"B","10a","x Depreciation Rate","#page4","https://www.mgic.com/-/media/value-adds/seb/","22-25000-sam-worksheet-help-doc.pdf","view=fit"]
[11,null,"B","10b","Total Mileage Depreciation","#page4","https://www.mgic.com/-/media/value-adds/seb/","22-25000-sam-worksheet-help-doc.pdf","view=fit"]
[12,null,"B",11,"Amortization/Casualty Loss","#page4","https://www.mgic.com/-/media/value-adds/seb/","22-25000-sam-worksheet-help-doc.pdf","view=fit"]
[13,"Schedule D","B",12,"Recurring Capital Gains (Loss)","#page5","https://www.mgic.com/-/media/value-adds/seb/","22-25000-sam-worksheet-help-doc.pdf","view=fit"]
[14,"Schedule E","B",13,"Royalty Income (Loss)","#page6","https://www.mgic.com/-/media/value-adds/seb/","22-25000-sam-worksheet-help-doc.pdf","view=fit"]
[15,null,"B",14,"Total Expenses","#page6","https://www.mgic.com/-/media/value-adds/seb/","22-25000-sam-worksheet-help-doc.pdf","view=fit"]
[16,null,"B",15,"Depletion","#page6","https://www.mgic.com/-/media/value-adds/seb/","22-25000-sam-worksheet-help-doc.pdf","view=fit"]
[17,"Schedule F","B",16,"Net Profit (Loss)","#page7","https://www.mgic.com/-/media/value-adds/seb/","22-25000-sam-worksheet-help-doc.pdf","view=fit"]
[18,null,"B",17,"Non-Tax Portion","#page7","https://www.mgic.com/-/media/value-adds/seb/","22-25000-sam-worksheet-help-doc.pdf","view=fit"]
[19,null,"B",18,"Deduct nonrecurring income","#page7","https://www.mgic.com/-/media/value-adds/seb/","22-25000-sam-worksheet-help-doc.pdf","view=fit"]
{"$rows_left_out":38}
{"sheet":"__NOTES__","index":5,"n_rows":2,"n_cols":4,"rows_kept":2,"cut":false,"hidden":true,"merged":[]}
[null,"DATE","NOTES_BY","NOTE"]
[1,"20220206_1955","Brian J. Torreano (BT)","For updates to hyperlinks on the SAM worksheet, open the '_HYPER_LKP_NEW_' worksheet and update the document, page numbers and links.  This updates the links throughout the SAM page.  After hyperlinks have been fixed, run the 'URLSetScreenTips' macro to update the screentips."]

{"sheet":"LOOKUPS","index":6,"n_rows":14,"n_cols":8,"rows_kept":14,"cut":false,"hidden":true,"merged":[]}
["VIRGIN_WBK","LKP_YEAR","MILEAGE_RATE","LKP_MONTHS","HAS_DATA_PROMPT","HAS_DATA_DEL",null,"SUMM_DATA_VALIDATION"]
[true,2020,0.27,0,true,true]
[null,2021,0.26,1]
[null,2022,0.26,2]
[null,null,null,3]
[null,null,null,4]
[null,null,null,5]
[null,null,null,6]
[null,null,null,7]
[null,null,null,8]
[null,null,null,9]
[null,null,null,10]
[null,null,null,11]
[null,null,null,12]

{"sheet":"SANDBOX","index":7,"n_rows":17,"n_cols":15,"rows_kept":17,"cut":false,"hidden":true,"merged":[]}
[]
[]
[]
[]
[null,null,null,null,null,null,"1/1/2021",null,{"$f":"IF(IFERROR(SEARCH(\"/\",G5),-1)=-1,\"FALSE\",\"TRUE\")","v":"TRUE"},null,{"$f":"IF(IFERROR(SEARCH(\"-\",G5),-1)=-1,\"FALSE\",\"TRUE\")","v":"FALSE"},null,{"$f":"IF(OR(NOT(IFERROR(SEARCH(\"/\",G5),-1)=-1),NOT(IFERROR(SEARCH(\"-\",G5),-1)=-1)),\"TRUE\",\"FALSE\")","v":"TRUE"}]
[null,null,null,null,null,null,"1-1-2021",null,{"$f":"IF(IFERROR(SEARCH(\"/\",G6),-1)=-1,\"FALSE\",\"TRUE\")","v":"FALSE"},null,{"$f":"IF(IFERROR(SEARCH(\"-\",G6),-1)=-1,\"FALSE\",\"TRUE\")","v":"TRUE"},null,{"$f":"IF(OR(NOT(IFERROR(SEARCH(\"/\",G6),-1)=-1),NOT(IFERROR(SEARCH(\"-\",G6),-1)=-1)),\"TRUE\",\"FALSE\")","v":"TRUE"}]
[null,null,null,null,null,null,"1.1.2021",null,"FALSE",null,"FALSE",null,"FALSE"]
[null,null,null,null,null,null,"1/1-2021",null,{"$f":"IF(IFERROR(SEARCH(\"/\",G8),-1)=-1,\"FALSE\",\"TRUE\")","v":"TRUE"},null,{"$f":"IF(IFERROR(SEARCH(\"-\",G8),-1)=-1,\"FALSE\",\"TRUE\")","v":"TRUE"},null,{"$f":"IF(OR(NOT(IFERROR(SEARCH(\"/\",G8),-1)=-1),NOT(IFERROR(SEARCH(\"-\",G8),-1)=-1)),\"TRUE\",\"FALSE\")","v":"TRUE"}]
[]
[]
[null,null,null,null,null,null,"2021-01-01"]
[]
[]
[]
[null,null,null,null,null,null,null,null,null,null,null,null,null,null,4]
[null,null,null,null,null,null,null,null,null,null,null,null,null,null,"8,9,10,11,12,13,14,15,16,17,18,22,23"]
[null,null,null,null,null,null,null,null,null,null,null,null,null,null,"4,8,9,10,11,12,13,14,15,16,17,18,22,23"]

{"sheet":"_PROC_EXTRAS_LKP_","index":8,"n_rows":12,"n_cols":3,"rows_kept":12,"cut":false,"hidden":true,"merged":[]}
["PROC_ADDR","PROC_FORMULA","TRUE_MSG"]
["H685","=IF(AND(ISNUMBER(_MY_VAL_),_MY_VAL_<>1,_MY_VAL_<>100),TRUE,FALSE)","For corporate earnings to be included in cash flow, investors generally require the borrower is a 100% owner."]
["K685","=IF(AND(ISNUMBER(_MY_VAL_),_MY_VAL_<>1,_MY_VAL_<>100),TRUE,FALSE)","For corporate earnings to be included in cash flow, investors generally require the borrower is a 100% owner."]
["H716","=IF(AND(ISNUMBER(_MY_VAL_),_MY_VAL_<>1,_MY_VAL_<>100),TRUE,FALSE)","For corporate earnings to be included in cash flow, investors generally require the borrower is a 100% owner."]
["K716","=IF(AND(ISNUMBER(_MY_VAL_),_MY_VAL_<>1,_MY_VAL_<>100),TRUE,FALSE)","For corporate earnings to be included in cash flow, investors generally require the borrower is a 100% owner."]
["H747","=IF(AND(ISNUMBER(_MY_VAL_),_MY_VAL_<>1,_MY_VAL_<>100),TRUE,FALSE)","For corporate earnings to be included in cash flow, investors generally require the borrower is a 100% owner."]
["K747","=IF(AND(ISNUMBER(_MY_VAL_),_MY_VAL_<>1,_MY_VAL_<>100),TRUE,FALSE)","For corporate earnings to be included in cash flow, investors generally require the borrower is a 100% owner."]
[]
[]
[]
[]
[null,{"$f":"IF(AND(ISNUMBER(A12),A12<>1,A12<>100),TRUE,FALSE)","v":false}]